2024 Org.apache.spark.sparkexception job aborted due to stage failure - May 20, 2019 · SparkException: Python worker failed to connect back when execute spark action 4 Pyspark. spark.SparkException: Job aborted due to stage failure: Task 0 in stage 15.0 failed 1 times, java.net.SocketException: Connection reset

 
Caused by: org.apache.spark.SparkException: Job aborted due to stage failure: Aborting TaskSet 0.0 because task 0 (partition 0) cannot run anywhere due to node and executor blacklist.. Org.apache.spark.sparkexception job aborted due to stage failure

Here are some ideas to fix this error: Serializable the class. Declare the instance only within the lambda function passed in map. Make the NotSerializable object as a static and create it once per machine. Call rdd.forEachPartition and create the NotSerializable object in there like this: rdd.forEachPartition (iter -> { NotSerializable ... I'm new to spark, and was trying to run the example JavaSparkPi.java, it runs well, but because i have to use this in another java s I copy all things from main to a method in the class and try to call the method in main, it saids . org.apache.spark.SparkException: Job aborted: Task not serializable: java.io.NotSerializableExceptionHere are some ideas to fix this error: Serializable the class. Declare the instance only within the lambda function passed in map. Make the NotSerializable object as a static and create it once per machine. Call rdd.forEachPartition and create the NotSerializable object in there like this: rdd.forEachPartition (iter -> { NotSerializable ... Feb 6, 2019 · I am new to PySpark. I have been writing my code with a test sample. Once I run the code on the larger file(3gb compressed). My code is only doing some filtering and joins. I keep getting errors org.apache.spark.SparkException: Job aborted due to stage failure: Task 1 in stage 188.0 failed 4 in Data Engineering a month ago; SparkException: There is no Credential Scope. in Data Governance a month agoWhen a stage failure occurs, the Spark driver logs report an exception similar to the following: org.apache.spark.SparkException: Job aborted due to stage failure: Task XXX in stage YYY failed 4 times, most recent failure: Lost task XXX in stage YYY (TID ZZZ, ip-xxx-xx-x-xxx.compute.internal, executor NNN): ExecutorLostFailure (executor NNN ...SparkException:执行 spark 操作时 Python 工作线程无法连接回spark.SparkException: Python worker failed to connect back.问问题当我尝试在 pyspark 执行此命令行时from pyspark import SparkConf, SparkContext# 创建SparkConf和SparkContextconf = SparkConf().setMaster("local").setAppName("licError: org.apache.spark.SparkException: Job aborted due to stage failure: Task 0 in stage 1985.0 failed 4 times, most recent failure: Lost task 0.3 in stage 1985.0 (TID 57569, 10.139.64.12, executor 15): com.microsoft.sqlserver.jdbc.SQLServerException: Conversion failed when converting the nvarchar value 'Aug' to data type int.Aug 12, 2021 · SparkException:执行 spark 操作时 Python 工作线程无法连接回spark.SparkException: Python worker failed to connect back.问问题当我尝试在 pyspark 执行此命令行时from pyspark import SparkConf, SparkContext# 创建SparkConf和SparkContextconf = SparkConf().setMaster("local").setAppName("lic May 16, 2022 · Problem Databricks throws an error when fitting a SparkML model or Pipeline: org.apache.spark.SparkException: Job aborted due to stage failure: Task 0 in s Dec 29, 2018 · Teams. Q&A for work. Connect and share knowledge within a single location that is structured and easy to search. Learn more about Teams org.apache.spark.SparkException: Job aborted due to stage failure: Task in stage failed,Lost task in stage : ExecutorLostFailure (executor 4 lost) 12 org.apache.spark.SparkException: Job aborted due to stage failure: Task 98 in stage 11.0 failed 4 timesWhen I run the demo : from pyspark.ml.linalg import Vectors import tempfile conf = SparkConf().setAppName('ansonzhou_test').setAll([ ('spark.executor.memory', '8g ...Teams. Q&A for work. Connect and share knowledge within a single location that is structured and easy to search. Learn more about TeamsAug 20, 2018 · 报错如下: : org.apache.spark.SparkException: Job aborted due to stage failure: Task 0 in stage 3.0 failed 4 times, most recent failure: ... Feb 23, 2022 · I am running spark jobs using datafactory in azure databricks. My cluster vesion is 9.1 LTS ML (includes Apache Spark 3.1.2, Scala 2.12). I am writing data on azure blob storage. While writing job ... Mar 24, 2018 · Here is the full list of commands creating the list, writing it to HDFS and finally printing out the results on the console using hdfs: spark-shell. After the shell has started you type: val nums = sc.parallelize (List (1,2,3,4,5)) nums.saveAsTextFile ("/tmp/simple_list") :quit. Now we read the data from HDFS (Hadoop File System): one can solve this job aborted error, either changing the "spark configuration" in the cluster or either use "try_cast" function when you are getting this error while inserting data from one table to another table in databricks. use dbr version : 10.4 LTS (includes Apache Spark 3.2.1, Scala 2.12)SparkException: Python worker failed to connect back when execute spark action 4 Pyspark. spark.SparkException: Job aborted due to stage failure: Task 0 in stage 15.0 failed 1 times, java.net.SocketException: Connection resetJan 16, 2023 · If issue persists, please contact Microsoft support for further assistance","Details":"org.apache.spark.SparkException: Job aborted due to stage failure: Task 320 in stage 21.0 failed 1 times, most recent failure: Lost task 320.0 in stage 21.0 (TID 1297, vm-42929650, executor 1): ExecutorLostFailure (executor 1 exited caused by one of the ... org.apache.spark.SparkException: Job aborted due to stage failure: Task 73 in stage 979.0 failed 1 times, most recent failure: Lost task 73.0 in stage 979.0 (TID 32624, localhost, executor driver): org.apache.spark.SparkException: Failed to execute user defined function($anonfun$4: (struct<other_double_VectorAssembler_a2059b1f0691:double ...Exception logs: 2018-08-26 16:15:02 INFO DAGScheduler:54 - ResultStage 0 (parquet at ReadDb2HDFS.scala:288) failed in 1008.933 s due to Job aborted due to stage failure: Task 0 in stage 0.0 failed 4 times, most recent failure: Lost task 0.3 in stage 0.0 (TID 3, master, executor 4): ExecutorLostFailure (executor 4 exited caused by one of the ...Mar 30, 2020 · org.apache.spark.SparkException: Job aborted due to stage failure: Task 29 in stage 0.0 failed 4 times, most recent failure: Lost task 29.3 in stage 0.0 (TID 92, 10.252.252.125, executor 23): ExecutorLostFailure (executor 23 exited caused by one of the running tasks) Reason: Remote RPC client disassociated. When a stage failure occurs, the Spark driver logs report an exception similar to the following: org.apache.spark.SparkException: Job aborted due to stage failure: Task XXX in stage YYY failed 4 times, most recent failure: Lost task XXX in stage YYY (TID ZZZ, ip-xxx-xx-x-xxx.compute.internal, executor NNN): ExecutorLostFailure (executor NNN ...org.apache.spark.SparkException: Job aborted due to stage failure: Task 3 in stage 6.0 failed 1 times, most recent failure: Lost task 3.0 in stage 6.0 (TID 62, LAPTOP-H7MM9952, executor driver): org.apache.spark.SparkException: Task failed while writing rows.Check the Availability of Free RAM - whether it matches the expectation of the job being executed. Run below on each of the servers in the cluster and check how much RAM & Space they have in offer. free -h. If you are using any HDFS files in the Spark job , make sure to Specify & Correctly use the HDFS URL.org.apache.spark.SparkException: Job aborted due to stage failure: Task 0 in stage 1486.0 failed 4 times, most recent failure: Lost task 0.3 in stage 1486.0 (TID 1665) (10.116.129.142 executor 0): org.apache.spark.SparkException: Failed to store executor broadcast spark_join_relation_469_-315473829 in BlockManager.I'm new to spark, and was trying to run the example JavaSparkPi.java, it runs well, but because i have to use this in another java s I copy all things from main to a method in the class and try to call the method in main, it saids . org.apache.spark.SparkException: Job aborted: Task not serializable: java.io.NotSerializableExceptionorg.apache.spark.SparkException: Job aborted due to stage failure: Task 73 in stage 979.0 failed 1 times, most recent failure: Lost task 73.0 in stage 979.0 (TID 32624, localhost, executor driver): org.apache.spark.SparkException: Failed to execute user defined function($anonfun$4: (struct<other_double_VectorAssembler_a2059b1f0691:double ...Aug 23, 2021 · org.apache.spark.SparkException: Job aborted due to stage failure: Total size of serialized results of 69 tasks (4.0 GB) is bigger than spark.driver.maxResultSize (4.0 GB) 08-23-2021 07:48 AM. set spark.conf.set ("spark.driver.maxResultSize", "20g") get spark.conf.get ("spark.driver.maxResultSize") // 20g which is expected in notebook , I did ... org.apache.spark.SparkException: Job aborted due to stage failure: Task 0 in stage 1486.0 failed 4 times, most recent failure: Lost task 0.3 in stage 1486.0 (TID 1665) (10.116.129.142 executor 0): org.apache.spark.SparkException: Failed to store executor broadcast spark_join_relation_469_-315473829 in BlockManager.Here is a method to parallelize serial JDBC reads across multiple spark workers... you can use this as a guide to customize it to your source data ... basically the main prerequisite is to have some kind of unique key to split on.According to the content of README.md of GitHub repo Azure/azure-cosmosdb-spark as the figure below, you may should switch to use the latest jar file azure-cosmosdb-spark_2.4.0_2.11-1.4.0-uber.jar in it. And the maven repo for Azure CosmosDB Spark has released to 1.4.1 version, as the figure below.Sep 1, 2022 · use dbr version : 10.4 LTS (includes Apache Spark 3.2.1, Scala 2.12) for spark configuartion edit the spark tab by editing the cluster and use below code there. "spark.sql.ansi.enabled false" The copy activity was interrupted part way through as the source database went offline which then caused the failure to complete writing the files properly. These were easily found as they were the most recently modified files.I am trying to solve the problems from O'Reilly book of Learning Spark. Below part of code is working fine from pyspark.sql.types import * from pyspark.sql import SparkSession from pyspark.sql.func...calling o110726.collectToPython. : org.apache.spark.SparkException: Job aborted due to stage failure: Task 7 in stage 1971.0 failed 4 times, most recent failure: Lost task 7.3 in stage 1971.0 (TID 31298) (10.54.144.30 executor 7):Nov 10, 2016 · Hi! I run 2 to spark an option SPARK_MAJOR_VERSION=2 pyspark --master yarn --verbose spark starts, I run the SC and get an error, the field in the table exactly there. not the problem SPARK_MAJOR_VERSION=2 pyspark --master yarn --verbose SPARK_MAJOR_VERSION is set to 2, using Spark2 Python 2.7.12 ... Oct 6, 2016 · Teams. Q&A for work. Connect and share knowledge within a single location that is structured and easy to search. Learn more about Teams I am running spark jobs using datafactory in azure databricks. My cluster vesion is 9.1 LTS ML (includes Apache Spark 3.1.2, Scala 2.12). I am writing data on azure blob storage. While writing job ...Nov 1, 2017 · Saved searches Use saved searches to filter your results more quickly If issue persists, please contact Microsoft support for further assistance","Details":"org.apache.spark.SparkException: Job aborted due to stage failure: Task 320 in stage 21.0 failed 1 times, most recent failure: Lost task 320.0 in stage 21.0 (TID 1297, vm-42929650, executor 1): ExecutorLostFailure (executor 1 exited caused by one of the ...Sep 20, 2021 · I've setted up pyspark on google colab using this tutorial from towardsdatascience. It runs well until it fails on trying to use IDF from pyspark.ml.feature import IDF idf = IDF(inputCol='hash', Mar 30, 2020 · org.apache.spark.SparkException: Job aborted due to stage failure: Task 29 in stage 0.0 failed 4 times, most recent failure: Lost task 29.3 in stage 0.0 (TID 92, 10.252.252.125, executor 23): ExecutorLostFailure (executor 23 exited caused by one of the running tasks) Reason: Remote RPC client disassociated. I installed apache-spark and pyspark on my machine (Ubuntu), and in Pycharm, I also updated the environment variables (e.g. spark_home, pyspark_python). I'm trying to do: import os, sys os.environ[' Nov 12, 2018 · Pyspark. spark.SparkException: Job aborted due to stage failure: Task 0 in stage 15.0 failed 1 times, java.net.SocketException: Connection reset Hot Network Questions Does America, like non-democratic countries like China, also have factions? Data collection is indirect, with data being stored both on the JVM side and Python side. While JVM memory can be released once data goes through socket, peak memory usage should account for both. Plain toPandas implementation collects Rows first, then creates Pandas DataFrame locally. This further increases (possibly doubles) memory usage. Jul 17, 2020 · Caused by: org.apache.spark.SparkException: Job aborted due to stage failure: Serialized task 2:0 was 155731289 bytes, which exceeds max allowed: spark.rpc.message.maxSize (134217728 bytes). Consider increasing spark.rpc.message.maxSize or using broadcast variables for large values. Based on the code , am not seeing anything wrong . Still you can analysis this issue based on the following data related . Make sure 4th line lines rdd has the data based on the collect().Pyspark. spark.SparkException: Job aborted due to stage failure: Task 0 in stage 15.0 failed 1 times, java.net.SocketException: Connection reset Hot Network Questions Main character is charged an exorbitant computing bill after abusing his uploaded consciousness powersAug 20, 2018 · 报错如下: : org.apache.spark.SparkException: Job aborted due to stage failure: Task 0 in stage 3.0 failed 4 times, most recent failure: ... Feb 1, 2017 · Pyspark. spark.SparkException: Job aborted due to stage failure: Task 0 in stage 15.0 failed 1 times, java.net.SocketException: Connection reset Hot Network Questions Main character is charged an exorbitant computing bill after abusing his uploaded consciousness powers : org.apache.spark.SparkException: Job aborted due to stage failure: Task 9 in stage 47.0 failed 4 times, most recent failure: Lost task 9.3 in stage 47.0 (TID 2256, ip-172-31-00-00.eu-west-1.compute.internal, executor 10): org.apache.spark.sql.execution.QueryExecutionException: Parquet column cannot be converted in file s3a://bucket/prod ...Oct 31, 2022 · I am trying to run a pyspark job but it is failing on RDD collectAndServe method. I do not have any memory issues. I have all updated jars in my jars folder. Python worker is crashing with below er... Teams. Q&A for work. Connect and share knowledge within a single location that is structured and easy to search. Learn more about TeamsAug 9, 2021 · You need to change this parameter in the cluster configuration. Go into the cluster settings, under Advanced select spark and paste spark.driver.maxResultSize 0 (for unlimited) or whatever the value suits you. Using 0 is not recommended. You should optimize the job by re partitioning. See the links below for more information: https://docs ... Nov 28, 2019 · : org.apache.spark.SparkException: Job aborted due to stage failure: Task 9 in stage 47.0 failed 4 times, most recent failure: Lost task 9.3 in stage 47.0 (TID 2256, ip-172-31-00-00.eu-west-1.compute.internal, executor 10): org.apache.spark.sql.execution.QueryExecutionException: Parquet column cannot be converted in file s3a://bucket/prod ... 不知道是什么原因。. (利用 Spark-submit 提交 参数都正常). 但是 集群上的版本是1.5,和2.0都无法跑出来结果,但是1.3就能出结果, 所以目前确定是 Spark 1.5以上的版本对协同过滤算法不兼容引起,具体原因不详。. task倾斜原因比较多,网络io,cpu,mem都有可能造成 ...Jun 25, 2020 · Apache Spark; koukou. ... org.apache.spark.SparkException: Job aborted due to stage failure: Task 0 in stage 30.0 failed 1 times, most recent failure: Lost task 0.0 ... Exception logs: 2018-08-26 16:15:02 INFO DAGScheduler:54 - ResultStage 0 (parquet at ReadDb2HDFS.scala:288) failed in 1008.933 s due to Job aborted due to stage failure: Task 0 in stage 0.0 failed 4 times, most recent failure: Lost task 0.3 in stage 0.0 (TID 3, master, executor 4): ExecutorLostFailure (executor 4 exited caused by one of the ...Here is a method to parallelize serial JDBC reads across multiple spark workers... you can use this as a guide to customize it to your source data ... basically the main prerequisite is to have some kind of unique key to split on.Caused by: org.apache.spark.SparkException: Job aborted due to stage failure: Total size of serialized results of 478 tasks (2026.0 MB) is bigger than spark.driver.maxResultSize (1024.0 MB) 当然可以通过调大spark.driver.maxResultSize的默认配置来解决问题,但如果不能从源头上解决小文件问题,以后还可能遇到 ...When a stage failure occurs, the Spark driver logs report an exception similar to the following: org.apache.spark.SparkException: Job aborted due to stage failure: Task XXX in stage YYY failed 4 times, most recent failure: Lost task XXX in stage YYY (TID ZZZ, ip-xxx-xx-x-xxx.compute.internal, executor NNN): ExecutorLostFailure (executor NNN ...I am trying to run a pyspark job but it is failing on RDD collectAndServe method. I do not have any memory issues. I have all updated jars in my jars folder. Python worker is crashing with below er...2 Answers. df.toPandas () collects all data to the driver node, hence it is very expensive operation. Also there is a spark property called maxResultSize. spark.driver.maxResultSize (default 1G) --> Limit of total size of serialized results of all partitions for each Spark action (e.g. collect) in bytes. Should be at least 1M, or 0 for unlimited.Error: org.apache.spark.SparkException: Job aborted due to stage failure: Task 0 in stage 1985.0 failed 4 times, most recent failure: Lost task 0.3 in stage 1985.0 (TID 57569, 10.139.64.12, executor 15): com.microsoft.sqlserver.jdbc.SQLServerException: Conversion failed when converting the nvarchar value 'Aug' to data type int.Apr 8, 2019 · scala - org.apache.spark.SparkException: Job aborted due to stage failure: Task 98 in stage 11.0 failed 4 times - Stack Overflow org.apache.spark.SparkException: Job aborted due to stage failure: Task 98 in stage 11.0 failed 4 times Ask Question Asked 4 years, 4 months ago Modified 4 years, 4 months ago Viewed 46k times You need to change this parameter in the cluster configuration. Go into the cluster settings, under Advanced select spark and paste spark.driver.maxResultSize 0 (for unlimited) or whatever the value suits you. Using 0 is not recommended. You should optimize the job by re partitioning. See the links below for more information: https://docs ...Job aborted due to stage failure: Task 5 in stage 3.0 failed 1 times 8 Exception: Java gateway process exited before sending the driver its port number while creating a Spark Session in Python1 Answer. PySpark DF are lazy loading. When you call .show () you are asking the prior steps to execute and anyone of them may not work, you just can't see it until you call .show () because they haven't executed. I go back to earlier steps and call .collect () on each operation of the DF. This will at least allow you to isolate where the bad ...Nov 15, 2021 · Job aborted due to stage failure: Task 5 in stage 3.0 failed 1 times 8 Exception: Java gateway process exited before sending the driver its port number while creating a Spark Session in Python Spark任务:Job aborted due to stage failure: Task 0 in stage 2.0 failed 4 times, most recent failure问题 跑Spark任务时报错,复制任务id(application_1111_222)到yarn页面中检索,发现报以下错误: Job aborted due to stage failure: Task 0 in stage 2.0 failed 4 times, most recent failure 使用sc读取Apr 8, 2019 · scala - org.apache.spark.SparkException: Job aborted due to stage failure: Task 98 in stage 11.0 failed 4 times - Stack Overflow org.apache.spark.SparkException: Job aborted due to stage failure: Task 98 in stage 11.0 failed 4 times Ask Question Asked 4 years, 4 months ago Modified 4 years, 4 months ago Viewed 46k times Jun 9, 2020 · Our reports and datasets imports data from Databricks Spark Delta tables using the Spark connector into our Premium P1 capacity. We're using incremental refresh for the larger (fact) tables, but we're having trouble with the initial refresh after publishing the pbix file. When refreshing large datasets it often fails after 30-60 minutes with ... SparkException:执行 spark 操作时 Python 工作线程无法连接回spark.SparkException: Python worker failed to connect back.问问题当我尝试在 pyspark 执行此命令行时from pyspark import SparkConf, SparkContext# 创建SparkConf和SparkContextconf = SparkConf().setMaster("local").setAppName("licI am new to Spark and recently installed it on a mac (with Python 2.7 in the system) using homebrew: brew install apache-spark and then installed Pyspark using pip3 in my virtual environment where I have python 3.6 installed.Sep 21, 2021 · I am trying to solve the problems from O'Reilly book of Learning Spark. Below part of code is working fine from pyspark.sql.types import * from pyspark.sql import SparkSession from pyspark.sql.func... org.apache.spark.shuffle.MetadataFetchFailedException: Missing an output location for shuffle 0 解决方法:这种问题一般发生在有大量shuffle操作的时候,task不断的failed,然后又重执行,一直循环下去,直到application失败。In my project i am using spark-Cassandra-connector to read the from Cassandra table and process it further into JavaRDD but i am facing issue while processing Cassandra row to javaRDD.Jul 7, 2019 · 1 I'm trying to use Linear Regression on a simple dataframe with one feature and one label using Python pyspark in Databricks. However, I'm running into some issues with stage failure. I've reviewed many similar problems, but most of them are in Scala or are out of the scope of what I'm doing here. Versions: one can solve this job aborted error, either changing the "spark configuration" in the cluster or either use "try_cast" function when you are getting this error while inserting data from one table to another table in databricks. use dbr version : 10.4 LTS (includes Apache Spark 3.2.1, Scala 2.12)org.apache.spark.SparkException: Job aborted due to stage failure: Task 73 in stage 979.0 failed 1 times, most recent failure: Lost task 73.0 in stage 979.0 (TID 32624, localhost, executor driver): org.apache.spark.SparkException: Failed to execute user defined function($anonfun$4: (struct<other_double_VectorAssembler_a2059b1f0691:double ...Exception logs: 2018-08-26 16:15:02 INFO DAGScheduler:54 - ResultStage 0 (parquet at ReadDb2HDFS.scala:288) failed in 1008.933 s due to Job aborted due to stage failure: Task 0 in stage 0.0 failed 4 times, most recent failure: Lost task 0.3 in stage 0.0 (TID 3, master, executor 4): ExecutorLostFailure (executor 4 exited caused by one of the ...Exception logs: 2018-08-26 16:15:02 INFO DAGScheduler:54 - ResultStage 0 (parquet at ReadDb2HDFS.scala:288) failed in 1008.933 s due to Job aborted due to stage failure: Task 0 in stage 0.0 failed 4 times, most recent failure: Lost task 0.3 in stage 0.0 (TID 3, master, executor 4): ExecutorLostFailure (executor 4 exited caused by one of the ...Sep 1, 2022 · use dbr version : 10.4 LTS (includes Apache Spark 3.2.1, Scala 2.12) for spark configuartion edit the spark tab by editing the cluster and use below code there. "spark.sql.ansi.enabled false" Data collection is indirect, with data being stored both on the JVM side and Python side. While JVM memory can be released once data goes through socket, peak memory usage should account for both. Plain toPandas implementation collects Rows first, then creates Pandas DataFrame locally. This further increases (possibly doubles) memory usage. Viewed 8k times. 1. I am trying to do some computation using UDFs. But after the computation when i try to convert the pyspark dataframe to pandas it gives me org.apache.spark.SparkException: Exception thrown in awaitResult: I will put down the reproducible code. import pandas as pd import numpy as np import time n = 10000 sample_df = pd ...Viewed 6k times. 4. I'm processing large spark dataframe in databricks and when I'm trying to write the final dataframe into csv format it gives me the following error: org.apache.spark.SparkException: Job aborted. #Creating a data frame with entire date seuence for each user df=pd.DataFrame ( {'transaction_date':dt_range2,'msno':msno1}) from ...Sep 21, 2021 · I am trying to solve the problems from O'Reilly book of Learning Spark. Below part of code is working fine from pyspark.sql.types import * from pyspark.sql import SparkSession from pyspark.sql.func... If issue persists, please contact Microsoft support for further assistance","Details":"org.apache.spark.SparkException: Job aborted due to stage failure: Task 320 in stage 21.0 failed 1 times, most recent failure: Lost task 320.0 in stage 21.0 (TID 1297, vm-42929650, executor 1): ExecutorLostFailure (executor 1 exited caused by one of the ...Check your data for null where not null should be present and especially on those columns that are subject of aggregation, like a reduce task, for example. In your case, it may be the id field. Your rdd is getting empty somewhere. The null pointer exception indicates that an aggregation task is attempted against of a null value. Check your data ...

I am doing it using spark code. But when i try to run the code I get following exception org.apache.spark.SparkException: Job aborted due to stage failure: Task 2 in stage 1.0 failed 4 times, most recent failure: Lost task 2.3 in stage 1.0 (TID 9, XXXX.XXX.XXX.local): org.apache.spark.SparkException: Task failed while writing rows. . Org.apache.spark.sparkexception job aborted due to stage failure

org.apache.spark.sparkexception job aborted due to stage failure

2 Answers. df.toPandas () collects all data to the driver node, hence it is very expensive operation. Also there is a spark property called maxResultSize. spark.driver.maxResultSize (default 1G) --> Limit of total size of serialized results of all partitions for each Spark action (e.g. collect) in bytes. Should be at least 1M, or 0 for unlimited.. ar 690 610 Exception logs: 2018-08-26 16:15:02 INFO DAGScheduler:54 - ResultStage 0 (parquet at ReadDb2HDFS.scala:288) failed in 1008.933 s due to Job aborted due to stage failure: Task 0 in stage 0.0 failed 4 times, most recent failure: Lost task 0.3 in stage 0.0 (TID 3, master, executor 4): ExecutorLostFailure (executor 4 exited caused by one of the ... what time does the inside of mcdonald 1 Answer. Sorted by: 1. You need to create an RDD of type RDD [Tuple [str]] but in your code, the line: rdd = spark.sparkContext.parallelize (comments) returns RDD [str] which then fails when you try to convert it to dataframe with that given schema. Try modifying that line to:: org.apache.spark.SparkException: Job aborted due to stage failure: Serialized task 302987:27 was 139041896 bytes, which exceeds max allowed: spark.akka.frameSize (134217728 bytes) - reserved (204800 bytes).Solution 1. Check your environment variables. You are getting “py4j.protocol.Py4JError: org.apache.spark.api.python.PythonUtils.getEncryptionEnabled does not exist in the JVM” due to Spark environemnt variables are not set right. If absolutely necessary you can set the property spark.driver.maxResultSize to a value <X>g higher than the value reported in the exception message in the cluster Spark config ( AWS | Azure ): spark.driver.maxResultSize < X > g. The default value is 4g. For details, see Application Properties. If you set a high limit, out-of-memory errors can ...Caused by: org.apache.spark.SparkException: Job aborted due to stage failure: Total size of serialized results of 478 tasks (2026.0 MB) is bigger than spark.driver.maxResultSize (1024.0 MB) 当然可以通过调大spark.driver.maxResultSize的默认配置来解决问题,但如果不能从源头上解决小文件问题,以后还可能遇到 ...Mar 30, 2020 · org.apache.spark.SparkException: Job aborted due to stage failure: Task 29 in stage 0.0 failed 4 times, most recent failure: Lost task 29.3 in stage 0.0 (TID 92, 10.252.252.125, executor 23): ExecutorLostFailure (executor 23 exited caused by one of the running tasks) Reason: Remote RPC client disassociated. Caused by: org.apache.spark.SparkException: Job aborted due to stage failure: Task 6 in stage 16.0 failed 4 times, most recent failure: Lost task 6.3 in stage 16.0 (TID 478, idc-sql-dms-13, executor 40): ExecutorLostFailure (executor 40 exited caused by one of the running tasks) Reason: Container killed by YARN for exceeding memory limits. 11.8 ... org.apache.spark.SparkException: Job aborted due to stage failure: Task 73 in stage 979.0 failed 1 times, most recent failure: Lost task 73.0 in stage 979.0 (TID 32624, localhost, executor driver): org.apache.spark.SparkException: Failed to execute user defined function($anonfun$4: (struct<other_double_VectorAssembler_a2059b1f0691:double ...calling o110726.collectToPython. : org.apache.spark.SparkException: Job aborted due to stage failure: Task 7 in stage 1971.0 failed 4 times, most recent failure: Lost task 7.3 in stage 1971.0 (TID 31298) (10.54.144.30 executor 7): taliercio May 20, 2019 · SparkException: Python worker failed to connect back when execute spark action 4 Pyspark. spark.SparkException: Job aborted due to stage failure: Task 0 in stage 15.0 failed 1 times, java.net.SocketException: Connection reset Feb 1, 2017 · Pyspark. spark.SparkException: Job aborted due to stage failure: Task 0 in stage 15.0 failed 1 times, java.net.SocketException: Connection reset Hot Network Questions Main character is charged an exorbitant computing bill after abusing his uploaded consciousness powers According to the content of README.md of GitHub repo Azure/azure-cosmosdb-spark as the figure below, you may should switch to use the latest jar file azure-cosmosdb-spark_2.4.0_2.11-1.4.0-uber.jar in it. And the maven repo for Azure CosmosDB Spark has released to 1.4.1 version, as the figure below.Use the DF transformations to create the statistics you need, THEN call collect/show to get the result back to the driver. That way you are only downloading the stats, not the full data.Apr 9, 2021 · Viewed 8k times. 1. I am trying to do some computation using UDFs. But after the computation when i try to convert the pyspark dataframe to pandas it gives me org.apache.spark.SparkException: Exception thrown in awaitResult: I will put down the reproducible code. import pandas as pd import numpy as np import time n = 10000 sample_df = pd ... org.apache.spark.SparkException: Job aborted due to stage failure: Task 73 in stage 979.0 failed 1 times, most recent failure: Lost task 73.0 in stage 979.0 (TID 32624, localhost, executor driver): org.apache.spark.SparkException: Failed to execute user defined function($anonfun$4: (struct<other_double_VectorAssembler_a2059b1f0691:double ...Data collection is indirect, with data being stored both on the JVM side and Python side. While JVM memory can be released once data goes through socket, peak memory usage should account for both. Plain toPandas implementation collects Rows first, then creates Pandas DataFrame locally. This further increases (possibly doubles) memory usage. Here is a method to parallelize serial JDBC reads across multiple spark workers... you can use this as a guide to customize it to your source data ... basically the main prerequisite is to have some kind of unique key to split on.May 15, 2017 · : org.apache.spark.SparkException: Job aborted due to stage failure: Serialized task 302987:27 was 139041896 bytes, which exceeds max allowed: spark.akka.frameSize (134217728 bytes) - reserved (204800 bytes). Sep 1, 2022 · one can solve this job aborted error, either changing the "spark configuration" in the cluster or either use "try_cast" function when you are getting this error while inserting data from one table to another table in databricks. use dbr version : 10.4 LTS (includes Apache Spark 3.2.1, Scala 2.12) Exception in thread "main" org.apache.spark.SparkException : Job aborted due to stage failure: Task 3 in stage 0.0 failed 4 times, most recent failure: Lost task 3.3 in stage 0.0 (TID 14, 192.168.10.38): ExecutorLostFailure (executor 3 lost) Driver stacktrace:Oct 31, 2022 · I am trying to run a pyspark job but it is failing on RDD collectAndServe method. I do not have any memory issues. I have all updated jars in my jars folder. Python worker is crashing with below er... Oct 6, 2017 · @Tim, actually no I have set of operations like val source_primary_key = source.map(rec => (rec.split(",")(0), rec)) source_primary_key.persist(StorageLevel.DISK_ONLY) val extra_in_source = source_primary_key.subtractByKey(destination_primary_key) var pureextinsrc = extra_in_source.count() extra_in_source.cache()and so on but before this its throwing out of memory exception while im fetching ... 不知道是什么原因。. (利用 Spark-submit 提交 参数都正常). 但是 集群上的版本是1.5,和2.0都无法跑出来结果,但是1.3就能出结果, 所以目前确定是 Spark 1.5以上的版本对协同过滤算法不兼容引起,具体原因不详。. task倾斜原因比较多,网络io,cpu,mem都有可能造成 ... . networkJan 3, 2022 · Based on the code , am not seeing anything wrong . Still you can analysis this issue based on the following data related . Make sure 4th line lines rdd has the data based on the collect(). Feb 6, 2019 · I am new to PySpark. I have been writing my code with a test sample. Once I run the code on the larger file(3gb compressed). My code is only doing some filtering and joins. I keep getting errors Sep 1, 2022 · one can solve this job aborted error, either changing the "spark configuration" in the cluster or either use "try_cast" function when you are getting this error while inserting data from one table to another table in databricks. use dbr version : 10.4 LTS (includes Apache Spark 3.2.1, Scala 2.12) Exception in thread "main" org.apache.spark.SparkException : Job aborted due to stage failure: Task 3 in stage 0.0 failed 4 times, most recent failure: Lost task 3.3 in stage 0.0 (TID 14, 192.168.10.38): ExecutorLostFailure (executor 3 lost) Driver stacktrace:Mar 24, 2018 · Here is the full list of commands creating the list, writing it to HDFS and finally printing out the results on the console using hdfs: spark-shell. After the shell has started you type: val nums = sc.parallelize (List (1,2,3,4,5)) nums.saveAsTextFile ("/tmp/simple_list") :quit. Now we read the data from HDFS (Hadoop File System): May 20, 2019 · SparkException: Python worker failed to connect back when execute spark action 4 Pyspark. spark.SparkException: Job aborted due to stage failure: Task 0 in stage 15.0 failed 1 times, java.net.SocketException: Connection reset Problem Databricks throws an error when fitting a SparkML model or Pipeline: org.apache.spark.SparkException: Job aborted due to stage failure: Task 0 in sI am doing it using spark code. But when i try to run the code I get following exception org.apache.spark.SparkException: Job aborted due to stage failure: Task 2 in stage 1.0 failed 4 times, most recent failure: Lost task 2.3 in stage 1.0 (TID 9, XXXX.XXX.XXX.local): org.apache.spark.SparkException: Task failed while writing rows. 1 Answer. PySpark DF are lazy loading. When you call .show () you are asking the prior steps to execute and anyone of them may not work, you just can't see it until you call .show () because they haven't executed. I go back to earlier steps and call .collect () on each operation of the DF. This will at least allow you to isolate where the bad ...Mar 23, 2014 · FYI in Spark 2.4 a lot of you will probably encounter this issue. Kryo serialization has gotten better but in many cases you cannot use spark.kryo.unsafe=true or the naive kryo serializer. For a quick fix try changing the following in your Spark configuration spark.kryo.unsafe="false" OR. spark.serializer="org.apache.spark.serializer ... . pltn rb1vq Teams. Q&A for work. Connect and share knowledge within a single location that is structured and easy to search. Learn more about Teams startem sit Exception in thread "main" org.apache.spark.SparkException : Job aborted due to stage failure: Task 3 in stage 0.0 failed 4 times, most recent failure: Lost task 3.3 in stage 0.0 (TID 14, 192.168.10.38): ExecutorLostFailure (executor 3 lost) Driver stacktrace:Caused by: org.apache.spark.SparkException: Job aborted due to stage failure: Task 6 in stage 16.0 failed 4 times, most recent failure: Lost task 6.3 in stage 16.0 (TID 478, idc-sql-dms-13, executor 40): ExecutorLostFailure (executor 40 exited caused by one of the running tasks) Reason: Container killed by YARN for exceeding memory limits. 11.8 ... Jul 17, 2020 · Caused by: org.apache.spark.SparkException: Job aborted due to stage failure: Serialized task 2:0 was 155731289 bytes, which exceeds max allowed: spark.rpc.message.maxSize (134217728 bytes). Consider increasing spark.rpc.message.maxSize or using broadcast variables for large values. I'm new to spark, and was trying to run the example JavaSparkPi.java, it runs well, but because i have to use this in another java s I copy all things from main to a method in the class and try to call the method in main, it saids . org.apache.spark.SparkException: Job aborted: Task not serializable: java.io.NotSerializableException. pueblo community craigslist org.apache.spark.SparkException: Job aborted due to stage failure: Task 1 in stage 188.0 failed 4 in Data Engineering a month ago; SparkException: There is no Credential Scope. in Data Governance a month agoYou need to change this parameter in the cluster configuration. Go into the cluster settings, under Advanced select spark and paste spark.driver.maxResultSize 0 (for unlimited) or whatever the value suits you. Using 0 is not recommended. You should optimize the job by re partitioning. See the links below for more information: https://docs .... austin farm and garden craigslist Oct 6, 2017 · @Tim, actually no I have set of operations like val source_primary_key = source.map(rec => (rec.split(",")(0), rec)) source_primary_key.persist(StorageLevel.DISK_ONLY) val extra_in_source = source_primary_key.subtractByKey(destination_primary_key) var pureextinsrc = extra_in_source.count() extra_in_source.cache()and so on but before this its throwing out of memory exception while im fetching ... Feb 6, 2019 · I am new to PySpark. I have been writing my code with a test sample. Once I run the code on the larger file(3gb compressed). My code is only doing some filtering and joins. I keep getting errors Mar 23, 2014 · FYI in Spark 2.4 a lot of you will probably encounter this issue. Kryo serialization has gotten better but in many cases you cannot use spark.kryo.unsafe=true or the naive kryo serializer. For a quick fix try changing the following in your Spark configuration spark.kryo.unsafe="false" OR. spark.serializer="org.apache.spark.serializer ... . best stroller selector Here are some ideas to fix this error: Serializable the class. Declare the instance only within the lambda function passed in map. Make the NotSerializable object as a static and create it once per machine. Call rdd.forEachPartition and create the NotSerializable object in there like this: rdd.forEachPartition (iter -> { NotSerializable ...Nov 28, 2019 · According to the content of README.md of GitHub repo Azure/azure-cosmosdb-spark as the figure below, you may should switch to use the latest jar file azure-cosmosdb-spark_2.4.0_2.11-1.4.0-uber.jar in it. And the maven repo for Azure CosmosDB Spark has released to 1.4.1 version, as the figure below. Here are some ideas to fix this error: Serializable the class. Declare the instance only within the lambda function passed in map. Make the NotSerializable object as a static and create it once per machine. Call rdd.forEachPartition and create the NotSerializable object in there like this: rdd.forEachPartition (iter -> { NotSerializable ...When a stage failure occurs, the Spark driver logs report an exception similar to the following: org.apache.spark.SparkException: Job aborted due to stage failure: Task XXX in stage YYY failed 4 times, most recent failure: Lost task XXX in stage YYY (TID ZZZ, ip-xxx-xx-x-xxx.compute.internal, executor NNN): ExecutorLostFailure (executor NNN ...I'm new to spark, and was trying to run the example JavaSparkPi.java, it runs well, but because i have to use this in another java s I copy all things from main to a method in the class and try to call the method in main, it saids . org.apache.spark.SparkException: Job aborted: Task not serializable: java.io.NotSerializableExceptionAug 26, 2018 · Exception logs: 2018-08-26 16:15:02 INFO DAGScheduler:54 - ResultStage 0 (parquet at ReadDb2HDFS.scala:288) failed in 1008.933 s due to Job aborted due to stage failure: Task 0 in stage 0.0 failed 4 times, most recent failure: Lost task 0.3 in stage 0.0 (TID 3, master, executor 4): ExecutorLostFailure (executor 4 exited caused by one of the ... You need to change this parameter in the cluster configuration. Go into the cluster settings, under Advanced select spark and paste spark.driver.maxResultSize 0 (for unlimited) or whatever the value suits you. Using 0 is not recommended. You should optimize the job by re partitioning.Feb 24, 2022 · Caused by: org.apache.spark.SparkException: Job aborted due to stage failure: Task 5 in stage 76.0 failed 4 times, most recent failure: Lost task 5.3 in stage 76.0 (TID 2334) (10.139.64.5 executor 6): com.databricks.sql.io.FileReadException: Error while reading file <File_Path> It is possible the underlying files have been updated. Nov 28, 2019 · : org.apache.spark.SparkException: Job aborted due to stage failure: Task 9 in stage 47.0 failed 4 times, most recent failure: Lost task 9.3 in stage 47.0 (TID 2256, ip-172-31-00-00.eu-west-1.compute.internal, executor 10): org.apache.spark.sql.execution.QueryExecutionException: Parquet column cannot be converted in file s3a://bucket/prod ... . triveni express indian sweets and restaurant Oct 31, 2022 · I am trying to run a pyspark job but it is failing on RDD collectAndServe method. I do not have any memory issues. I have all updated jars in my jars folder. Python worker is crashing with below er... Apr 8, 2019 · scala - org.apache.spark.SparkException: Job aborted due to stage failure: Task 98 in stage 11.0 failed 4 times - Stack Overflow org.apache.spark.SparkException: Job aborted due to stage failure: Task 98 in stage 11.0 failed 4 times Ask Question Asked 4 years, 4 months ago Modified 4 years, 4 months ago Viewed 46k times org.apache.spark.shuffle.MetadataFetchFailedException: Missing an output location for shuffle 0 解决方法:这种问题一般发生在有大量shuffle操作的时候,task不断的failed,然后又重执行,一直循环下去,直到application失败。Caused by: org.apache.spark.SparkException: Job aborted due to stage failure: Serialized task 2:0 was 155731289 bytes, which exceeds max allowed: spark.rpc.message.maxSize (134217728 bytes). Consider increasing spark.rpc.message.maxSize or using broadcast variables for large values.org.apache.spark.SparkException: Job aborted due to stage failure: ShuffleMapStage 20 (repartition at data_prep.scala:87) has failed the maximum allowable number of times: 4. Most recent failure reason: org.apache.spark.shuffle.MetadataFetchFailedException: Missing an output location for shuffle 9You may not have right permissions. I have the same problem when I use a docker image jupyter/pyspark-notebook to run an example code of pyspark, and it was solved by using root within the container.SparkException: Job aborted due to stage failure: Task 58 in stage 13.0 failed 4 times, most recent failure: Lost task 58.3 in stage 13.0 (TID 488, 10.32.14.43, executor 4): java.lang.IllegalArgumentException: Illegal pattern character 'Q'May 8, 2021 · org.apache.spark.SparkException: Job aborted due to stage failure: Task 3 in stage 6.0 failed 1 times, most recent failure: Lost task 3.0 in stage 6.0 (TID 62, LAPTOP-H7MM9952, executor driver): org.apache.spark.SparkException: Task failed while writing rows. Feb 1, 2017 · Pyspark. spark.SparkException: Job aborted due to stage failure: Task 0 in stage 15.0 failed 1 times, java.net.SocketException: Connection reset Hot Network Questions Main character is charged an exorbitant computing bill after abusing his uploaded consciousness powers You may not have right permissions. I have the same problem when I use a docker image jupyter/pyspark-notebook to run an example code of pyspark, and it was solved by using root within the container.Nov 2, 2020 · Teams. Q&A for work. Connect and share knowledge within a single location that is structured and easy to search. Learn more about Teams Mar 24, 2018 · Here is the full list of commands creating the list, writing it to HDFS and finally printing out the results on the console using hdfs: spark-shell. After the shell has started you type: val nums = sc.parallelize (List (1,2,3,4,5)) nums.saveAsTextFile ("/tmp/simple_list") :quit. Now we read the data from HDFS (Hadoop File System): Mar 23, 2014 · FYI in Spark 2.4 a lot of you will probably encounter this issue. Kryo serialization has gotten better but in many cases you cannot use spark.kryo.unsafe=true or the naive kryo serializer. For a quick fix try changing the following in your Spark configuration spark.kryo.unsafe="false" OR. spark.serializer="org.apache.spark.serializer ... Jun 20, 2019 · Here is a method to parallelize serial JDBC reads across multiple spark workers... you can use this as a guide to customize it to your source data ... basically the main prerequisite is to have some kind of unique key to split on. May 16, 2022 · Problem Databricks throws an error when fitting a SparkML model or Pipeline: org.apache.spark.SparkException: Job aborted due to stage failure: Task 0 in s org.apache.spark.SparkException: **Job aborted due to stage failure: Task 0 in stage 1.0 failed 1 times, most recent failure: Lost task 0.0 in stage 1.0 (TID 1 ...I am new to Spark and recently installed it on a mac (with Python 2.7 in the system) using homebrew: brew install apache-spark and then installed Pyspark using pip3 in my virtual environment where I have python 3.6 installed.SparkException: Job aborted due to stage failure: Task 58 in stage 13.0 failed 4 times, most recent failure: Lost task 58.3 in stage 13.0 (TID 488, 10.32.14.43, executor 4): java.lang.IllegalArgumentException: Illegal pattern character 'Q'Feb 24, 2022 · Caused by: org.apache.spark.SparkException: Job aborted due to stage failure: Task 5 in stage 76.0 failed 4 times, most recent failure: Lost task 5.3 in stage 76.0 (TID 2334) (10.139.64.5 executor 6): com.databricks.sql.io.FileReadException: Error while reading file <File_Path> It is possible the underlying files have been updated. . amc dine in southpoint 17 reviews Jul 7, 2019 · 1 I'm trying to use Linear Regression on a simple dataframe with one feature and one label using Python pyspark in Databricks. However, I'm running into some issues with stage failure. I've reviewed many similar problems, but most of them are in Scala or are out of the scope of what I'm doing here. Versions: Teams. Q&A for work. Connect and share knowledge within a single location that is structured and easy to search. Learn more about TeamsCaused by: org.apache.spark.SparkException: Job aborted due to stage failure: Aborting TaskSet 0.0 because task 0 (partition 0) cannot run anywhere due to node and executor blacklist.Check the Availability of Free RAM - whether it matches the expectation of the job being executed. Run below on each of the servers in the cluster and check how much RAM & Space they have in offer. free -h. If you are using any HDFS files in the Spark job , make sure to Specify & Correctly use the HDFS URL.Job aborted due to stage failure: ShuffleMapStage 20 (repartition at data_prep.scala:87) has failed the maximum allowable number of times: 4 2 Why does Spark fail with FetchFailed error?Thanks for contributing an answer to Stack Overflow! Please be sure to answer the question.Provide details and share your research! But avoid …. Asking for help, clarification, or responding to other answers.Feb 23, 2022 · I am running spark jobs using datafactory in azure databricks. My cluster vesion is 9.1 LTS ML (includes Apache Spark 3.1.2, Scala 2.12). I am writing data on azure blob storage. While writing job ... Job aborted due to stage failure: Task 5 in stage 3.0 failed 1 times 8 Exception: Java gateway process exited before sending the driver its port number while creating a Spark Session in PythonHere are some ideas to fix this error: Serializable the class. Declare the instance only within the lambda function passed in map. Make the NotSerializable object as a static and create it once per machine. Call rdd.forEachPartition and create the NotSerializable object in there like this: rdd.forEachPartition (iter -> { NotSerializable ...I installed apache-spark and pyspark on my machine (Ubuntu), and in Pycharm, I also updated the environment variables (e.g. spark_home, pyspark_python). I'm trying to do: import os, sys os.environ['Aug 23, 2021 · org.apache.spark.SparkException: Job aborted due to stage failure: Total size of serialized results of 69 tasks (4.0 GB) is bigger than spark.driver.maxResultSize (4.0 GB) 08-23-2021 07:48 AM. set spark.conf.set ("spark.driver.maxResultSize", "20g") get spark.conf.get ("spark.driver.maxResultSize") // 20g which is expected in notebook , I did ... Here are some ideas to fix this error: Serializable the class. Declare the instance only within the lambda function passed in map. Make the NotSerializable object as a static and create it once per machine. Call rdd.forEachPartition and create the NotSerializable object in there like this: rdd.forEachPartition (iter -> { NotSerializable ... Jun 5, 2019 · org.apache.spark.SparkException: Job aborted due to stage failure: Task in stage failed,Lost task in stage : ExecutorLostFailure (executor 4 lost) 12 org.apache.spark.SparkException: Job aborted due to stage failure: Task 98 in stage 11.0 failed 4 times . loads org.apache.spark.SparkException: **Job aborted due to stage failure: Task 0 in stage 1.0 failed 1 times, most recent failure: Lost task 0.0 in stage 1.0 (TID 1 ...Exception in thread "main" org.apache.spark.SparkException: Job aborted due to stage failure: Task 0 in stage 2.0 failed 1 times, most recent failure: Lost task 0.0 in stage 2.0 (TID 119, localhost, executor driver): ExecutorLostFailure (executor driver exited caused by one of the running tasks) Reason: Executor heartbeat timed out after 128839 ...I am doing it using spark code. But when i try to run the code I get following exception org.apache.spark.SparkException: Job aborted due to stage failure: Task 2 in stage 1.0 failed 4 times, most recent failure: Lost task 2.3 in stage 1.0 (TID 9, XXXX.XXX.XXX.local): org.apache.spark.SparkException: Task failed while writing rows.Mar 29, 2020 · Check Apache Spark installation on Windows 10 steps. Use different versions of Apache Spark (tried 2.4.3 / 2.4.2 / 2.3.4). Disable firewall windows and antivirus that I have installed. Tried to initialize the SparkContext manually with sc = spark.sparkContext (found this possible solution at this question here in Stackoverflow, didn´t work for ... I am running spark jobs using datafactory in azure databricks. My cluster vesion is 9.1 LTS ML (includes Apache Spark 3.1.2, Scala 2.12). I am writing data on azure blob storage. While writing job ...Jun 20, 2019 · Here is a method to parallelize serial JDBC reads across multiple spark workers... you can use this as a guide to customize it to your source data ... basically the main prerequisite is to have some kind of unique key to split on. Nov 10, 2016 · Hi! I run 2 to spark an option SPARK_MAJOR_VERSION=2 pyspark --master yarn --verbose spark starts, I run the SC and get an error, the field in the table exactly there. not the problem SPARK_MAJOR_VERSION=2 pyspark --master yarn --verbose SPARK_MAJOR_VERSION is set to 2, using Spark2 Python 2.7.12 ... Caused by: org.apache.spark.SparkException: Job aborted due to stage failure: Aborting TaskSet 0.0 because task 0 (partition 0) cannot run anywhere due to node and executor blacklist.When a stage failure occurs, the Spark driver logs report an exception similar to the following: org.apache.spark.SparkException: Job aborted due to stage failure: Task XXX in stage YYY failed 4 times, most recent failure: Lost task XXX in stage YYY (TID ZZZ, ip-xxx-xx-x-xxx.compute.internal, executor NNN): ExecutorLostFailure (executor NNN ...Data collection is indirect, with data being stored both on the JVM side and Python side. While JVM memory can be released once data goes through socket, peak memory usage should account for both. Plain toPandas implementation collects Rows first, then creates Pandas DataFrame locally. This further increases (possibly doubles) memory usage.. breast expansion video You need to change this parameter in the cluster configuration. Go into the cluster settings, under Advanced select spark and paste spark.driver.maxResultSize 0 (for unlimited) or whatever the value suits you. Using 0 is not recommended. You should optimize the job by re partitioning. See the links below for more information: https://docs .... chat pt Solve : org.apache.spark.SparkException: Job aborted due to stage failure 1 Spark Error: Executor XXX finished with state EXITED message Command exited with code 1 exitStatus 1Data collection is indirect, with data being stored both on the JVM side and Python side. While JVM memory can be released once data goes through socket, peak memory usage should account for both. Plain toPandas implementation collects Rows first, then creates Pandas DataFrame locally. This further increases (possibly doubles) memory usage. Data collection is indirect, with data being stored both on the JVM side and Python side. While JVM memory can be released once data goes through socket, peak memory usage should account for both. Plain toPandas implementation collects Rows first, then creates Pandas DataFrame locally. This further increases (possibly doubles) memory usage.Jun 5, 2019 · org.apache.spark.SparkException: Job aborted due to stage failure: Task in stage failed,Lost task in stage : ExecutorLostFailure (executor 4 lost) 12 org.apache.spark.SparkException: Job aborted due to stage failure: Task 98 in stage 11.0 failed 4 times Feb 14, 2020 · Go into the cluster settings, under Advanced select spark and paste spark.driver.maxResultSize 0 (for unlimited) or whatever the value suits you. Using 0 is not recommended. You should optimize the job by re partitioning. For more details, refer "Spark Configurations - Application Properties". Hope this helps. Do let us know if you any further ... Problem Databricks throws an error when fitting a SparkML model or Pipeline: org.apache.spark.SparkException: Job aborted due to stage failure: Task 0 in sJun 20, 2019 · Here is a method to parallelize serial JDBC reads across multiple spark workers... you can use this as a guide to customize it to your source data ... basically the main prerequisite is to have some kind of unique key to split on. . whatpercent27s a bottom In my project i am using spark-Cassandra-connector to read the from Cassandra table and process it further into JavaRDD but i am facing issue while processing Cassandra row to javaRDD.Solution 1. Check your environment variables. You are getting “py4j.protocol.Py4JError: org.apache.spark.api.python.PythonUtils.getEncryptionEnabled does not exist in the JVM” due to Spark environemnt variables are not set right. Jan 4, 2019 · Exception in thread "main" org.apache.spark.SparkException: Job aborted due to stage failure: Task 0 in stage 2.0 failed 1 times, most recent failure: Lost task 0.0 in stage 2.0 (TID 119, localhost, executor driver): ExecutorLostFailure (executor driver exited caused by one of the running tasks) Reason: Executor heartbeat timed out after 128839 ... Go into the cluster settings, under Advanced select spark and paste spark.driver.maxResultSize 0 (for unlimited) or whatever the value suits you. Using 0 is not recommended. You should optimize the job by re partitioning. For more details, refer "Spark Configurations - Application Properties". Hope this helps. Do let us know if you any further ...I am trying to run a pyspark job but it is failing on RDD collectAndServe method. I do not have any memory issues. I have all updated jars in my jars folder. Python worker is crashing with below er...Oct 6, 2017 · @Tim, actually no I have set of operations like val source_primary_key = source.map(rec => (rec.split(",")(0), rec)) source_primary_key.persist(StorageLevel.DISK_ONLY) val extra_in_source = source_primary_key.subtractByKey(destination_primary_key) var pureextinsrc = extra_in_source.count() extra_in_source.cache()and so on but before this its throwing out of memory exception while im fetching ... at Source 'source': org.apache.spark.SparkException: Job aborted due to stage failure: Task 3 in stage 15.0 failed 1 times, most recent failure: Lost task 3.0 in stage 15.0 (TID 35, vm-85b29723, executor 1): java.nio.charset.MalformedInputException: Input length = 1Oct 6, 2017 · @Tim, actually no I have set of operations like val source_primary_key = source.map(rec => (rec.split(",")(0), rec)) source_primary_key.persist(StorageLevel.DISK_ONLY) val extra_in_source = source_primary_key.subtractByKey(destination_primary_key) var pureextinsrc = extra_in_source.count() extra_in_source.cache()and so on but before this its throwing out of memory exception while im fetching ... In my project i am using spark-Cassandra-connector to read the from Cassandra table and process it further into JavaRDD but i am facing issue while processing Cassandra row to javaRDD.. telephone number to ocable box stuck on l 3 Nov 1, 2017 · Saved searches Use saved searches to filter your results more quickly Part of Microsoft Azure Collective. 0. Caused by: org.apache.spark.SparkException: Job aborted due to stage failure: Task 5 in stage 76.0 failed 4 times, most recent failure: Lost task 5.3 in stage 76.0 (TID 2334) (10.139.64.5 executor 6): com.databricks.sql.io.FileReadException: Error while reading file <File_Path> It is possible the ...When I run the demo : from pyspark.ml.linalg import Vectors import tempfile conf = SparkConf().setAppName('ansonzhou_test').setAll([ ('spark.executor.memory', '8g ...Jun 25, 2020 · Apache Spark; koukou. ... org.apache.spark.SparkException: Job aborted due to stage failure: Task 0 in stage 30.0 failed 1 times, most recent failure: Lost task 0.0 ... Error: org.apache.spark.SparkException: Job aborted due to stage failure: Task 0 in stage 1985.0 failed 4 times, most recent failure: Lost task 0.3 in stage 1985.0 (TID 57569, 10.139.64.12, executor 15): com.microsoft.sqlserver.jdbc.SQLServerException: Conversion failed when converting the nvarchar value 'Aug' to data type int.spark.shuffle.consolidateFiles will only help if you override the default to use HashShuffleManager instead of the default HashShuffleManager enabled by default after Spark 1.2 (which defaults to spark.shuffle.manager=sort), and I think does not even apply to Spark 2.x –Nov 28, 2019 · : org.apache.spark.SparkException: Job aborted due to stage failure: Task 9 in stage 47.0 failed 4 times, most recent failure: Lost task 9.3 in stage 47.0 (TID 2256, ip-172-31-00-00.eu-west-1.compute.internal, executor 10): org.apache.spark.sql.execution.QueryExecutionException: Parquet column cannot be converted in file s3a://bucket/prod ... one can solve this job aborted error, either changing the "spark configuration" in the cluster or either use "try_cast" function when you are getting this error while inserting data from one table to another table in databricks. use dbr version : 10.4 LTS (includes Apache Spark 3.2.1, Scala 2.12)You may not have right permissions. I have the same problem when I use a docker image jupyter/pyspark-notebook to run an example code of pyspark, and it was solved by using root within the container.For Spark jobs submitted with --deploy-mode cluster, run the following command on the master node to find stage failures in the YARN application logs. Replace application_id with the ID of your Spark application (for example, application_1572839353552_0008 ). yarn logs -applicationId application_id | grep "Job aborted due to stage failure" -A 10. Stack Overflow Public questions & answers; Stack Overflow for Teams Where developers & technologists share private knowledge with coworkers; Talent Build your employer brandAug 20, 2018 · 报错如下: : org.apache.spark.SparkException: Job aborted due to stage failure: Task 0 in stage 3.0 failed 4 times, most recent failure: ... Feb 1, 2017 · Pyspark. spark.SparkException: Job aborted due to stage failure: Task 0 in stage 15.0 failed 1 times, java.net.SocketException: Connection reset Hot Network Questions Main character is charged an exorbitant computing bill after abusing his uploaded consciousness powers In my project i am using spark-Cassandra-connector to read the from Cassandra table and process it further into JavaRDD but i am facing issue while processing Cassandra row to javaRDD.. jeffpercent27s model May 8, 2021 · org.apache.spark.SparkException: Job aborted due to stage failure: Task 3 in stage 6.0 failed 1 times, most recent failure: Lost task 3.0 in stage 6.0 (TID 62, LAPTOP-H7MM9952, executor driver): org.apache.spark.SparkException: Task failed while writing rows. org.apache.spark.SparkException: Job aborted due to stage failure: Task 0 in stage 1486.0 failed 4 times, most recent failure: Lost task 0.3 in stage 1486.0 (TID 1665) (10.116.129.142 executor 0): org.apache.spark.SparkException: Failed to store executor broadcast spark_join_relation_469_-315473829 in BlockManager.Part of Microsoft Azure Collective. 0. Caused by: org.apache.spark.SparkException: Job aborted due to stage failure: Task 5 in stage 76.0 failed 4 times, most recent failure: Lost task 5.3 in stage 76.0 (TID 2334) (10.139.64.5 executor 6): com.databricks.sql.io.FileReadException: Error while reading file <File_Path> It is possible the ...Exception logs: 2018-08-26 16:15:02 INFO DAGScheduler:54 - ResultStage 0 (parquet at ReadDb2HDFS.scala:288) failed in 1008.933 s due to Job aborted due to stage failure: Task 0 in stage 0.0 failed 4 times, most recent failure: Lost task 0.3 in stage 0.0 (TID 3, master, executor 4): ExecutorLostFailure (executor 4 exited caused by one of the ...SparkException: Python worker failed to connect back when execute spark action 4 Pyspark. spark.SparkException: Job aborted due to stage failure: Task 0 in stage 15.0 failed 1 times, java.net.SocketException: Connection reset. iphone 11 64 gb teknosa I am doing it using spark code. But when i try to run the code I get following exception org.apache.spark.SparkException: Job aborted due to stage failure: Task 2 in stage 1.0 failed 4 times, most recent failure: Lost task 2.3 in stage 1.0 (TID 9, XXXX.XXX.XXX.local): org.apache.spark.SparkException: Task failed while writing rows. Oct 6, 2016 · Teams. Q&A for work. Connect and share knowledge within a single location that is structured and easy to search. Learn more about Teams Oct 31, 2022 · I am trying to run a pyspark job but it is failing on RDD collectAndServe method. I do not have any memory issues. I have all updated jars in my jars folder. Python worker is crashing with below er... SparkException: Python worker failed to connect back when execute spark action 4 Pyspark. spark.SparkException: Job aborted due to stage failure: Task 0 in stage 15.0 failed 1 times, java.net.SocketException: Connection resethello everyone I am working on PySpark Python and I have mentioned the code and getting some issue, I am wondering if someone knows about the following issue? windowSpec = Window.partitionBy(Nov 1, 2017 · Saved searches Use saved searches to filter your results more quickly . grandpa xnxx Nov 15, 2021 · Job aborted due to stage failure: Task 5 in stage 3.0 failed 1 times 8 Exception: Java gateway process exited before sending the driver its port number while creating a Spark Session in Python : org.apache.spark.SparkException: Job aborted due to stage failure: Serialized task 302987:27 was 139041896 bytes, which exceeds max allowed: spark.akka.frameSize (134217728 bytes) - reserved (204800 bytes).Problem Databricks throws an error when fitting a SparkML model or Pipeline: org.apache.spark.SparkException: Job aborted due to stage failure: Task 0 in sSolve : org.apache.spark.SparkException: Job aborted due to stage failure 1 Spark Error: Executor XXX finished with state EXITED message Command exited with code 1 exitStatus 1Caused by: org.apache.spark.SparkException: Job aborted due to stage failure: Serialized task 2:0 was 155731289 bytes, which exceeds max allowed: spark.rpc.message.maxSize (134217728 bytes). Consider increasing spark.rpc.message.maxSize or using broadcast variables for large values.spark.shuffle.consolidateFiles will only help if you override the default to use HashShuffleManager instead of the default HashShuffleManager enabled by default after Spark 1.2 (which defaults to spark.shuffle.manager=sort), and I think does not even apply to Spark 2.x –I am trying to solve the problems from O'Reilly book of Learning Spark. Below part of code is working fine from pyspark.sql.types import * from pyspark.sql import SparkSession from pyspark.sql.func...不知道是什么原因。. (利用 Spark-submit 提交 参数都正常). 但是 集群上的版本是1.5,和2.0都无法跑出来结果,但是1.3就能出结果, 所以目前确定是 Spark 1.5以上的版本对协同过滤算法不兼容引起,具体原因不详。. task倾斜原因比较多,网络io,cpu,mem都有可能造成 ... Nov 28, 2019 · According to the content of README.md of GitHub repo Azure/azure-cosmosdb-spark as the figure below, you may should switch to use the latest jar file azure-cosmosdb-spark_2.4.0_2.11-1.4.0-uber.jar in it. And the maven repo for Azure CosmosDB Spark has released to 1.4.1 version, as the figure below. Solve : org.apache.spark.SparkException: Job aborted due to stage failure 1 Spark Error: Executor XXX finished with state EXITED message Command exited with code 1 exitStatus 1Feb 14, 2020 · Go into the cluster settings, under Advanced select spark and paste spark.driver.maxResultSize 0 (for unlimited) or whatever the value suits you. Using 0 is not recommended. You should optimize the job by re partitioning. For more details, refer "Spark Configurations - Application Properties". Hope this helps. Do let us know if you any further ... org.apache.spark.SparkException: Job aborted due to stage failure: Task 3 in stage 6.0 failed 1 times, most recent failure: Lost task 3.0 in stage 6.0 (TID 62, LAPTOP-H7MM9952, executor driver): org.apache.spark.SparkException: Task failed while writing rows.Use the DF transformations to create the statistics you need, THEN call collect/show to get the result back to the driver. That way you are only downloading the stats, not the full data.Exception logs: 2018-08-26 16:15:02 INFO DAGScheduler:54 - ResultStage 0 (parquet at ReadDb2HDFS.scala:288) failed in 1008.933 s due to Job aborted due to stage failure: Task 0 in stage 0.0 failed 4 times, most recent failure: Lost task 0.3 in stage 0.0 (TID 3, master, executor 4): ExecutorLostFailure (executor 4 exited caused by one of the ...Hi Team, I am writing a Delta file in ADL-Gen2 from ADF for multiple files dynamically using Dataflows activity. For the initial run i am able to read the file from Azure DataBricks . But when i rerun the pipeline with truncate and load i am getting…Teams. Q&A for work. Connect and share knowledge within a single location that is structured and easy to search. Learn more about Teams. wp_mna I am new to Spark and recently installed it on a mac (with Python 2.7 in the system) using homebrew: brew install apache-spark and then installed Pyspark using pip3 in my virtual environment where I have python 3.6 installed.SparkException: Python worker failed to connect back when execute spark action 4 Pyspark. spark.SparkException: Job aborted due to stage failure: Task 0 in stage 15.0 failed 1 times, java.net.SocketException: Connection resetAug 26, 2018 · Exception logs: 2018-08-26 16:15:02 INFO DAGScheduler:54 - ResultStage 0 (parquet at ReadDb2HDFS.scala:288) failed in 1008.933 s due to Job aborted due to stage failure: Task 0 in stage 0.0 failed 4 times, most recent failure: Lost task 0.3 in stage 0.0 (TID 3, master, executor 4): ExecutorLostFailure (executor 4 exited caused by one of the ... Here are some ideas to fix this error: Serializable the class. Declare the instance only within the lambda function passed in map. Make the NotSerializable object as a static and create it once per machine. Call rdd.forEachPartition and create the NotSerializable object in there like this: rdd.forEachPartition (iter -> { NotSerializable ... Mar 24, 2018 · Here is the full list of commands creating the list, writing it to HDFS and finally printing out the results on the console using hdfs: spark-shell. After the shell has started you type: val nums = sc.parallelize (List (1,2,3,4,5)) nums.saveAsTextFile ("/tmp/simple_list") :quit. Now we read the data from HDFS (Hadoop File System): Solution 1. Check your environment variables. You are getting “py4j.protocol.Py4JError: org.apache.spark.api.python.PythonUtils.getEncryptionEnabled does not exist in the JVM” due to Spark environemnt variables are not set right. . mandt bank near me hours Nov 11, 2021 · 1 Answer. PySpark DF are lazy loading. When you call .show () you are asking the prior steps to execute and anyone of them may not work, you just can't see it until you call .show () because they haven't executed. I go back to earlier steps and call .collect () on each operation of the DF. This will at least allow you to isolate where the bad ... Spark任务:Job aborted due to stage failure: Task 0 in stage 2.0 failed 4 times, most recent failure问题 跑Spark任务时报错,复制任务id(application_1111_222)到yarn页面中检索,发现报以下错误: Job aborted due to stage failure: Task 0 in stage 2.0 failed 4 times, most recent failure 使用sc读取org.apache.spark.SparkException: Job aborted due to stage failure: Task 3 in stage 6.0 failed 1 times, most recent failure: Lost task 3.0 in stage 6.0 (TID 62, LAPTOP-H7MM9952, executor driver): org.apache.spark.SparkException: Task failed while writing rows.Hi Team, I am writing a Delta file in ADL-Gen2 from ADF for multiple files dynamically using Dataflows activity. For the initial run i am able to read the file from Azure DataBricks . But when i rerun the pipeline with truncate and load i am getting…May 11, 2022 · If absolutely necessary you can set the property spark.driver.maxResultSize to a value <X>g higher than the value reported in the exception message in the cluster Spark config ( AWS | Azure ): spark.driver.maxResultSize < X > g. The default value is 4g. For details, see Application Properties. If you set a high limit, out-of-memory errors can ... Jan 10, 2020 · Teams. Q&A for work. Connect and share knowledge within a single location that is structured and easy to search. Learn more about Teams Jun 20, 2019 · Here is a method to parallelize serial JDBC reads across multiple spark workers... you can use this as a guide to customize it to your source data ... basically the main prerequisite is to have some kind of unique key to split on. Oct 6, 2016 · Teams. Q&A for work. Connect and share knowledge within a single location that is structured and easy to search. Learn more about Teams Nov 12, 2018 · Pyspark. spark.SparkException: Job aborted due to stage failure: Task 0 in stage 15.0 failed 1 times, java.net.SocketException: Connection reset Hot Network Questions Does America, like non-democratic countries like China, also have factions? . who does atandt ship with Teams. Q&A for work. Connect and share knowledge within a single location that is structured and easy to search. Learn more about TeamsNov 28, 2019 · According to the content of README.md of GitHub repo Azure/azure-cosmosdb-spark as the figure below, you may should switch to use the latest jar file azure-cosmosdb-spark_2.4.0_2.11-1.4.0-uber.jar in it. And the maven repo for Azure CosmosDB Spark has released to 1.4.1 version, as the figure below. SparkException: Job aborted due to stage failure: Task 58 in stage 13.0 failed 4 times, most recent failure: Lost task 58.3 in stage 13.0 (TID 488, 10.32.14.43, executor 4): java.lang.IllegalArgumentException: Illegal pattern character 'Q'Apache Spark; koukou. ... org.apache.spark.SparkException: Job aborted due to stage failure: Task 0 in stage 30.0 failed 1 times, most recent failure: Lost task 0.0 ...Jul 7, 2019 · 1 I'm trying to use Linear Regression on a simple dataframe with one feature and one label using Python pyspark in Databricks. However, I'm running into some issues with stage failure. I've reviewed many similar problems, but most of them are in Scala or are out of the scope of what I'm doing here. Versions: Aug 12, 2021 · SparkException:执行 spark 操作时 Python 工作线程无法连接回spark.SparkException: Python worker failed to connect back.问问题当我尝试在 pyspark 执行此命令行时from pyspark import SparkConf, SparkContext# 创建SparkConf和SparkContextconf = SparkConf().setMaster("local").setAppName("lic Here are some ideas to fix this error: Serializable the class. Declare the instance only within the lambda function passed in map. Make the NotSerializable object as a static and create it once per machine. Call rdd.forEachPartition and create the NotSerializable object in there like this: rdd.forEachPartition (iter -> { NotSerializable ... Apr 9, 2021 · Viewed 8k times. 1. I am trying to do some computation using UDFs. But after the computation when i try to convert the pyspark dataframe to pandas it gives me org.apache.spark.SparkException: Exception thrown in awaitResult: I will put down the reproducible code. import pandas as pd import numpy as np import time n = 10000 sample_df = pd ... org.apache.spark.SparkException: Job aborted due to stage failure: 8 Databricks Exception: Total size of serialized results is bigger than spark.driver.maxResultsSizeorg.apache.spark.SparkException: Job aborted due to stage failure: 8 Databricks Exception: Total size of serialized results is bigger than spark.driver.maxResultsSizeTeams. Q&A for work. Connect and share knowledge within a single location that is structured and easy to search. Learn more about Teams. honda monkey chopper frame Spark任务:Job aborted due to stage failure: Task 0 in stage 2.0 failed 4 times, most recent failure问题 跑Spark任务时报错,复制任务id(application_1111_222)到yarn页面中检索,发现报以下错误: Job aborted due to stage failure: Task 0 in stage 2.0 failed 4 times, most recent failure 使用sc读取If I had a penny for every time I asked people "have you tried increasing the number of partitions to something quite large like at least 4 tasks per CPU - like even as high as 1000 partitions?"If absolutely necessary you can set the property spark.driver.maxResultSize to a value <X>g higher than the value reported in the exception message in the cluster Spark config ( AWS | Azure ): spark.driver.maxResultSize < X > g. The default value is 4g. For details, see Application Properties. If you set a high limit, out-of-memory errors can ...Job aborted due to stage failure: Task 5 in stage 3.0 failed 1 times 8 Exception: Java gateway process exited before sending the driver its port number while creating a Spark Session in PythonApache Spark; koukou. ... org.apache.spark.SparkException: Job aborted due to stage failure: Task 0 in stage 30.0 failed 1 times, most recent failure: Lost task 0.0 ...FYI in Spark 2.4 a lot of you will probably encounter this issue. Kryo serialization has gotten better but in many cases you cannot use spark.kryo.unsafe=true or the naive kryo serializer. For a quick fix try changing the following in your Spark configuration spark.kryo.unsafe="false" OR. spark.serializer="org.apache.spark.serializer ...You need to change this parameter in the cluster configuration. Go into the cluster settings, under Advanced select spark and paste spark.driver.maxResultSize 0 (for unlimited) or whatever the value suits you. Using 0 is not recommended. You should optimize the job by re partitioning. See the links below for more information: https://docs .... nty : org.apache.spark.SparkException: Job aborted due to stage failure: Serialized task 302987:27 was 139041896 bytes, which exceeds max allowed: spark.akka.frameSize (134217728 bytes) - reserved (204800 bytes).Solve : org.apache.spark.SparkException: Job aborted due to stage failure Load 7 more related questions Show fewer related questions 0Aug 20, 2018 · 报错如下: : org.apache.spark.SparkException: Job aborted due to stage failure: Task 0 in stage 3.0 failed 4 times, most recent failure: ... Saved searches Use saved searches to filter your results more quicklyI am running spark jobs using datafactory in azure databricks. My cluster vesion is 9.1 LTS ML (includes Apache Spark 3.1.2, Scala 2.12). I am writing data on azure blob storage. While writing job ...Mar 29, 2020 · Check Apache Spark installation on Windows 10 steps. Use different versions of Apache Spark (tried 2.4.3 / 2.4.2 / 2.3.4). Disable firewall windows and antivirus that I have installed. Tried to initialize the SparkContext manually with sc = spark.sparkContext (found this possible solution at this question here in Stackoverflow, didn´t work for ... org.apache.spark.SparkException: Job aborted due to stage failure: ShuffleMapStage 20 (repartition at data_prep.scala:87) has failed the maximum allowable number of times: 4. Most recent failure reason: org.apache.spark.shuffle.MetadataFetchFailedException: Missing an output location for shuffle 9Feb 1, 2017 · Pyspark. spark.SparkException: Job aborted due to stage failure: Task 0 in stage 15.0 failed 1 times, java.net.SocketException: Connection reset Hot Network Questions Main character is charged an exorbitant computing bill after abusing his uploaded consciousness powers Solve : org.apache.spark.SparkException: Job aborted due to stage failure Load 7 more related questions Show fewer related questions 0. 23 inch dishwasher lowe 不知道是什么原因。. (利用 Spark-submit 提交 参数都正常). 但是 集群上的版本是1.5,和2.0都无法跑出来结果,但是1.3就能出结果, 所以目前确定是 Spark 1.5以上的版本对协同过滤算法不兼容引起,具体原因不详。. task倾斜原因比较多,网络io,cpu,mem都有可能造成 ... Teams. Q&A for work. Connect and share knowledge within a single location that is structured and easy to search. Learn more about TeamsAug 23, 2021 · org.apache.spark.SparkException: Job aborted due to stage failure: Total size of serialized results of 69 tasks (4.0 GB) is bigger than spark.driver.maxResultSize (4.0 GB) 08-23-2021 07:48 AM. set spark.conf.set ("spark.driver.maxResultSize", "20g") get spark.conf.get ("spark.driver.maxResultSize") // 20g which is expected in notebook , I did ... Jan 24, 2022 · 1 Answer. Sorted by: 1. You need to create an RDD of type RDD [Tuple [str]] but in your code, the line: rdd = spark.sparkContext.parallelize (comments) returns RDD [str] which then fails when you try to convert it to dataframe with that given schema. Try modifying that line to: . john wick 4 showtimes near regal independence mall and rpx Aug 20, 2018 · 报错如下: : org.apache.spark.SparkException: Job aborted due to stage failure: Task 0 in stage 3.0 failed 4 times, most recent failure: ... Feb 1, 2017 · Pyspark. spark.SparkException: Job aborted due to stage failure: Task 0 in stage 15.0 failed 1 times, java.net.SocketException: Connection reset Hot Network Questions Main character is charged an exorbitant computing bill after abusing his uploaded consciousness powers I am running spark jobs using datafactory in azure databricks. My cluster vesion is 9.1 LTS ML (includes Apache Spark 3.1.2, Scala 2.12). I am writing data on azure blob storage. While writing job ...Dec 29, 2018 · Teams. Q&A for work. Connect and share knowledge within a single location that is structured and easy to search. Learn more about Teams Pyspark. spark.SparkException: Job aborted due to stage failure: Task 0 in stage 15.0 failed 1 times, java.net.SocketException: Connection reset Hot Network Questions Does America, like non-democratic countries like China, also have factions?org.apache.spark.SparkException: Job aborted due to stage failure: Task 0 in stage 1486.0 failed 4 times, most recent failure: Lost task 0.3 in stage 1486.0 (TID 1665) (10.116.129.142 executor 0): org.apache.spark.SparkException: Failed to store executor broadcast spark_join_relation_469_-315473829 in BlockManager.Jan 11, 2021 · SparkException: Job aborted due to stage failure: Task 58 in stage 13.0 failed 4 times, most recent failure: Lost task 58.3 in stage 13.0 (TID 488, 10.32.14.43, executor 4): java.lang.IllegalArgumentException: Illegal pattern character 'Q' Dec 6, 2018 · 1. "Accept timed out" generally points to a problem with your spark instance. It may be overloaded or not enough resources (memory/cpu) to start your job or it might be a temporary network issue. You can monitor you jobs on Spark UI. Also there is some issue with your code. . schaeffer Here are some ideas to fix this error: Serializable the class. Declare the instance only within the lambda function passed in map. Make the NotSerializable object as a static and create it once per machine. Call rdd.forEachPartition and create the NotSerializable object in there like this: rdd.forEachPartition (iter -> { NotSerializable ... 1. "Accept timed out" generally points to a problem with your spark instance. It may be overloaded or not enough resources (memory/cpu) to start your job or it might be a temporary network issue. You can monitor you jobs on Spark UI. Also there is some issue with your code.Nov 28, 2019 · According to the content of README.md of GitHub repo Azure/azure-cosmosdb-spark as the figure below, you may should switch to use the latest jar file azure-cosmosdb-spark_2.4.0_2.11-1.4.0-uber.jar in it. And the maven repo for Azure CosmosDB Spark has released to 1.4.1 version, as the figure below. If absolutely necessary you can set the property spark.driver.maxResultSize to a value <X>g higher than the value reported in the exception message in the cluster Spark config ( AWS | Azure ): spark.driver.maxResultSize < X > g. The default value is 4g. For details, see Application Properties. If you set a high limit, out-of-memory errors can ...Nov 1, 2017 · Saved searches Use saved searches to filter your results more quickly 报错如下: : org.apache.spark.SparkException: Job aborted due to stage failure: Task 0 in stage 3.0 failed 4 times, most recent failure: ...: org.apache.spark.SparkException: Job aborted due to stage failure: Task 9 in stage 47.0 failed 4 times, most recent failure: Lost task 9.3 in stage 47.0 (TID 2256, ip-172-31-00-00.eu-west-1.compute.internal, executor 10): org.apache.spark.sql.execution.QueryExecutionException: Parquet column cannot be converted in file s3a://bucket/prod ...Sep 1, 2022 · one can solve this job aborted error, either changing the "spark configuration" in the cluster or either use "try_cast" function when you are getting this error while inserting data from one table to another table in databricks. use dbr version : 10.4 LTS (includes Apache Spark 3.2.1, Scala 2.12) Mar 23, 2014 · FYI in Spark 2.4 a lot of you will probably encounter this issue. Kryo serialization has gotten better but in many cases you cannot use spark.kryo.unsafe=true or the naive kryo serializer. For a quick fix try changing the following in your Spark configuration spark.kryo.unsafe="false" OR. spark.serializer="org.apache.spark.serializer ... . craigslist philadelphia cars and trucks by owner FYI in Spark 2.4 a lot of you will probably encounter this issue. Kryo serialization has gotten better but in many cases you cannot use spark.kryo.unsafe=true or the naive kryo serializer. For a quick fix try changing the following in your Spark configuration spark.kryo.unsafe="false" OR. spark.serializer="org.apache.spark.serializer ...Part of Microsoft Azure Collective. 0. Caused by: org.apache.spark.SparkException: Job aborted due to stage failure: Task 5 in stage 76.0 failed 4 times, most recent failure: Lost task 5.3 in stage 76.0 (TID 2334) (10.139.64.5 executor 6): com.databricks.sql.io.FileReadException: Error while reading file <File_Path> It is possible the ...Here are some ideas to fix this error: Serializable the class. Declare the instance only within the lambda function passed in map. Make the NotSerializable object as a static and create it once per machine. Call rdd.forEachPartition and create the NotSerializable object in there like this: rdd.forEachPartition (iter -> { NotSerializable ... Sep 20, 2021 · I've setted up pyspark on google colab using this tutorial from towardsdatascience. It runs well until it fails on trying to use IDF from pyspark.ml.feature import IDF idf = IDF(inputCol='hash', I'm new to spark, and was trying to run the example JavaSparkPi.java, it runs well, but because i have to use this in another java s I copy all things from main to a method in the class and try to call the method in main, it saids . org.apache.spark.SparkException: Job aborted: Task not serializable: java.io.NotSerializableExceptionhello everyone I am working on PySpark Python and I have mentioned the code and getting some issue, I am wondering if someone knows about the following issue? windowSpec = Window.partitionBy(org.apache.spark.SparkException: Job aborted due to stage failure: Total size of serialized results of 69 tasks (4.0 GB) is bigger than spark.driver.maxResultSize (4.0 GB) 08-23-2021 07:48 AM. set spark.conf.set ("spark.driver.maxResultSize", "20g") get spark.conf.get ("spark.driver.maxResultSize") // 20g which is expected in notebook , I did ...If issue persists, please contact Microsoft support for further assistance","Details":"org.apache.spark.SparkException: Job aborted due to stage failure: Task 320 in stage 21.0 failed 1 times, most recent failure: Lost task 320.0 in stage 21.0 (TID 1297, vm-42929650, executor 1): ExecutorLostFailure (executor 1 exited caused by one of the ...Oct 30, 2018 · You need to change this parameter in the cluster configuration. Go into the cluster settings, under Advanced select spark and paste spark.driver.maxResultSize 0 (for unlimited) or whatever the value suits you. Using 0 is not recommended. You should optimize the job by re partitioning. 不知道是什么原因。. (利用 Spark-submit 提交 参数都正常). 但是 集群上的版本是1.5,和2.0都无法跑出来结果,但是1.3就能出结果, 所以目前确定是 Spark 1.5以上的版本对协同过滤算法不兼容引起,具体原因不详。. task倾斜原因比较多,网络io,cpu,mem都有可能造成 ...1. "Accept timed out" generally points to a problem with your spark instance. It may be overloaded or not enough resources (memory/cpu) to start your job or it might be a temporary network issue. You can monitor you jobs on Spark UI. Also there is some issue with your code.. yard water fountain Jan 11, 2021 · SparkException: Job aborted due to stage failure: Task 58 in stage 13.0 failed 4 times, most recent failure: Lost task 58.3 in stage 13.0 (TID 488, 10.32.14.43, executor 4): java.lang.IllegalArgumentException: Illegal pattern character 'Q' Dec 29, 2020 · When I run the demo : from pyspark.ml.linalg import Vectors import tempfile conf = SparkConf().setAppName('ansonzhou_test').setAll([ ('spark.executor.memory', '8g ... If issue persists, please contact Microsoft support for further assistance","Details":"org.apache.spark.SparkException: Job aborted due to stage failure: Task 320 in stage 21.0 failed 1 times, most recent failure: Lost task 320.0 in stage 21.0 (TID 1297, vm-42929650, executor 1): ExecutorLostFailure (executor 1 exited caused by one of the ...2 Answers. df.toPandas () collects all data to the driver node, hence it is very expensive operation. Also there is a spark property called maxResultSize. spark.driver.maxResultSize (default 1G) --> Limit of total size of serialized results of all partitions for each Spark action (e.g. collect) in bytes. Should be at least 1M, or 0 for unlimited.Jan 10, 2020 · Teams. Q&A for work. Connect and share knowledge within a single location that is structured and easy to search. Learn more about Teams org.apache.spark.SparkException: Job aborted due to stage failure: Task 1 in stage 188.0 failed 4 in Data Engineering a month ago; SparkException: There is no Credential Scope. in Data Governance a month agoApr 15, 2021 · The copy activity was interrupted part way through as the source database went offline which then caused the failure to complete writing the files properly. These were easily found as they were the most recently modified files. You need to change this parameter in the cluster configuration. Go into the cluster settings, under Advanced select spark and paste spark.driver.maxResultSize 0 (for unlimited) or whatever the value suits you. Using 0 is not recommended. You should optimize the job by re partitioning. See the links below for more information: https://docs ...不知道是什么原因。. (利用 Spark-submit 提交 参数都正常). 但是 集群上的版本是1.5,和2.0都无法跑出来结果,但是1.3就能出结果, 所以目前确定是 Spark 1.5以上的版本对协同过滤算法不兼容引起,具体原因不详。. task倾斜原因比较多,网络io,cpu,mem都有可能造成 ...Teams. Q&A for work. Connect and share knowledge within a single location that is structured and easy to search. Learn more about Teams. get back you don 2 Answers. df.toPandas () collects all data to the driver node, hence it is very expensive operation. Also there is a spark property called maxResultSize. spark.driver.maxResultSize (default 1G) --> Limit of total size of serialized results of all partitions for each Spark action (e.g. collect) in bytes. Should be at least 1M, or 0 for unlimited.Sep 1, 2022 · one can solve this job aborted error, either changing the "spark configuration" in the cluster or either use "try_cast" function when you are getting this error while inserting data from one table to another table in databricks. use dbr version : 10.4 LTS (includes Apache Spark 3.2.1, Scala 2.12) Teams. Q&A for work. Connect and share knowledge within a single location that is structured and easy to search. Learn more about TeamsOct 30, 2018 · You need to change this parameter in the cluster configuration. Go into the cluster settings, under Advanced select spark and paste spark.driver.maxResultSize 0 (for unlimited) or whatever the value suits you. Using 0 is not recommended. You should optimize the job by re partitioning. >>Job aborted due to stage failure: Total size of serialized results of 19 tasks (4.2 GB) is bigger than spark.driver.maxResultSize (4.0 GB)'.. The exception was raised by the IDbCommand interface. Please take a look at following document about maxResultsize issue:Nov 15, 2021 · Job aborted due to stage failure: Task 5 in stage 3.0 failed 1 times 8 Exception: Java gateway process exited before sending the driver its port number while creating a Spark Session in Python . studio apartments under dollar400 near mebrainpop.com brainpop Teams. Q&A for work. Connect and share knowledge within a single location that is structured and easy to search. Learn more about TeamsNov 10, 2016 · Hi! I run 2 to spark an option SPARK_MAJOR_VERSION=2 pyspark --master yarn --verbose spark starts, I run the SC and get an error, the field in the table exactly there. not the problem SPARK_MAJOR_VERSION=2 pyspark --master yarn --verbose SPARK_MAJOR_VERSION is set to 2, using Spark2 Python 2.7.12 ... Aug 20, 2018 · 报错如下: : org.apache.spark.SparkException: Job aborted due to stage failure: Task 0 in stage 3.0 failed 4 times, most recent failure: ... Spark任务:Job aborted due to stage failure: Task 0 in stage 2.0 failed 4 times, most recent failure问题 跑Spark任务时报错,复制任务id(application_1111_222)到yarn页面中检索,发现报以下错误: Job aborted due to stage failure: Task 0 in stage 2.0 failed 4 times, most recent failure 使用sc读取Stack Overflow Public questions & answers; Stack Overflow for Teams Where developers & technologists share private knowledge with coworkers; Talent Build your employer brandJan 24, 2022 · 1 Answer. Sorted by: 1. You need to create an RDD of type RDD [Tuple [str]] but in your code, the line: rdd = spark.sparkContext.parallelize (comments) returns RDD [str] which then fails when you try to convert it to dataframe with that given schema. Try modifying that line to: . aaronpercent27s pending delivery meaning Apr 8, 2019 · scala - org.apache.spark.SparkException: Job aborted due to stage failure: Task 98 in stage 11.0 failed 4 times - Stack Overflow org.apache.spark.SparkException: Job aborted due to stage failure: Task 98 in stage 11.0 failed 4 times Ask Question Asked 4 years, 4 months ago Modified 4 years, 4 months ago Viewed 46k times Stack Overflow Public questions & answers; Stack Overflow for Teams Where developers & technologists share private knowledge with coworkers; Talent Build your employer brandSaved searches Use saved searches to filter your results more quicklySparkException: Job aborted due to stage failure: Task 58 in stage 13.0 failed 4 times, most recent failure: Lost task 58.3 in stage 13.0 (TID 488, 10.32.14.43, executor 4): java.lang.IllegalArgumentException: Illegal pattern character 'Q'Mar 29, 2020 · Check Apache Spark installation on Windows 10 steps. Use different versions of Apache Spark (tried 2.4.3 / 2.4.2 / 2.3.4). Disable firewall windows and antivirus that I have installed. Tried to initialize the SparkContext manually with sc = spark.sparkContext (found this possible solution at this question here in Stackoverflow, didn´t work for ... hello everyone I am working on PySpark Python and I have mentioned the code and getting some issue, I am wondering if someone knows about the following issue? windowSpec = Window.partitionBy(. gilbert and terrell org.apache.spark.SparkException: Job aborted due to stage failure: Task 0 in stage 1486.0 failed 4 times, most recent failure: Lost task 0.3 in stage 1486.0 (TID 1665) (10.116.129.142 executor 0): org.apache.spark.SparkException: Failed to store executor broadcast spark_join_relation_469_-315473829 in BlockManager.org.apache.spark.SparkException: Job aborted due to stage failure: Total size of serialized results of 69 tasks (4.0 GB) is bigger than spark.driver.maxResultSize (4.0 GB) 08-23-2021 07:48 AM. set spark.conf.set ("spark.driver.maxResultSize", "20g") get spark.conf.get ("spark.driver.maxResultSize") // 20g which is expected in notebook , I did ...Apr 19, 2015 · org.apache.spark.SparkException: Job aborted due to stage failure: Task 7 in stage 0.0 failed 4 times, most recent failure: Lost task 7.3 in stage 0.0 (TID 11, fujitsu11.inevm.ru):java.lang.ClassNotFoundException: maven.maven1.Document java.net.URLClassLoader$1.run (URLClassLoader.java:366) java.net.URLClassLoader$1.run (URLClassLoader.java:35... Check your data for null where not null should be present and especially on those columns that are subject of aggregation, like a reduce task, for example. In your case, it may be the id field. Your rdd is getting empty somewhere. The null pointer exception indicates that an aggregation task is attempted against of a null value. Check your data ...Teams. Q&A for work. Connect and share knowledge within a single location that is structured and easy to search. Learn more about TeamsCaused by: org.apache.spark.SparkException: Job aborted due to stage failure: Total size of serialized results of 478 tasks (2026.0 MB) is bigger than spark.driver.maxResultSize (1024.0 MB) 当然可以通过调大spark.driver.maxResultSize的默认配置来解决问题,但如果不能从源头上解决小文件问题,以后还可能遇到 .... hrothmund 2 Answers. df.toPandas () collects all data to the driver node, hence it is very expensive operation. Also there is a spark property called maxResultSize. spark.driver.maxResultSize (default 1G) --> Limit of total size of serialized results of all partitions for each Spark action (e.g. collect) in bytes. Should be at least 1M, or 0 for unlimited.Based on the code , am not seeing anything wrong . Still you can analysis this issue based on the following data related . Make sure 4th line lines rdd has the data based on the collect().Nov 15, 2021 · Job aborted due to stage failure: Task 5 in stage 3.0 failed 1 times 8 Exception: Java gateway process exited before sending the driver its port number while creating a Spark Session in Python Check your data for null where not null should be present and especially on those columns that are subject of aggregation, like a reduce task, for example. In your case, it may be the id field. Your rdd is getting empty somewhere. The null pointer exception indicates that an aggregation task is attempted against of a null value. Check your data ...Nov 28, 2019 · : org.apache.spark.SparkException: Job aborted due to stage failure: Task 9 in stage 47.0 failed 4 times, most recent failure: Lost task 9.3 in stage 47.0 (TID 2256, ip-172-31-00-00.eu-west-1.compute.internal, executor 10): org.apache.spark.sql.execution.QueryExecutionException: Parquet column cannot be converted in file s3a://bucket/prod ... Nov 15, 2021 · Job aborted due to stage failure: Task 5 in stage 3.0 failed 1 times 8 Exception: Java gateway process exited before sending the driver its port number while creating a Spark Session in Python Caused by: org.apache.spark.SparkException: Job aborted due to stage failure: Total size of serialized results of 478 tasks (2026.0 MB) is bigger than spark.driver.maxResultSize (1024.0 MB) 当然可以通过调大spark.driver.maxResultSize的默认配置来解决问题,但如果不能从源头上解决小文件问题,以后还可能遇到 ...不知道是什么原因。. (利用 Spark-submit 提交 参数都正常). 但是 集群上的版本是1.5,和2.0都无法跑出来结果,但是1.3就能出结果, 所以目前确定是 Spark 1.5以上的版本对协同过滤算法不兼容引起,具体原因不详。. task倾斜原因比较多,网络io,cpu,mem都有可能造成 ...Jul 7, 2019 · 1 I'm trying to use Linear Regression on a simple dataframe with one feature and one label using Python pyspark in Databricks. However, I'm running into some issues with stage failure. I've reviewed many similar problems, but most of them are in Scala or are out of the scope of what I'm doing here. Versions: Solution 1. Check your environment variables. You are getting “py4j.protocol.Py4JError: org.apache.spark.api.python.PythonUtils.getEncryptionEnabled does not exist in the JVM” due to Spark environemnt variables are not set right.. mechanic jobs near me hiring full time Teams. Q&A for work. Connect and share knowledge within a single location that is structured and easy to search. Learn more about TeamsNov 2, 2020 · Teams. Q&A for work. Connect and share knowledge within a single location that is structured and easy to search. Learn more about Teams Based on the code , am not seeing anything wrong . Still you can analysis this issue based on the following data related . Make sure 4th line lines rdd has the data based on the collect().org.apache.spark.SparkException: Job aborted due to stage failure: Task XXX in stage YYY failed 4 times, most recent failure: Lost task XXX in stage YYY (TID ZZZ, ip-xxx-xx-x-xxx.compute.internal, executor NNN): ExecutorLostFailure (executor NNN exited caused by one of the running tasks) Reason: ... 解決方法 理由コードの検索Nov 11, 2021 · 1 Answer. PySpark DF are lazy loading. When you call .show () you are asking the prior steps to execute and anyone of them may not work, you just can't see it until you call .show () because they haven't executed. I go back to earlier steps and call .collect () on each operation of the DF. This will at least allow you to isolate where the bad ... You may not have right permissions. I have the same problem when I use a docker image jupyter/pyspark-notebook to run an example code of pyspark, and it was solved by using root within the container.Jan 11, 2021 · SparkException: Job aborted due to stage failure: Task 58 in stage 13.0 failed 4 times, most recent failure: Lost task 58.3 in stage 13.0 (TID 488, 10.32.14.43, executor 4): java.lang.IllegalArgumentException: Illegal pattern character 'Q' org.apache.spark.SparkException: Job aborted due to stage failure: Task 2 in stage 0.0 failed 4 times, most recent failure: Lost task 2.3 in stage 0.0 Updating the dependancy in SBT solved the problem.Oct 6, 2017 · @Tim, actually no I have set of operations like val source_primary_key = source.map(rec => (rec.split(",")(0), rec)) source_primary_key.persist(StorageLevel.DISK_ONLY) val extra_in_source = source_primary_key.subtractByKey(destination_primary_key) var pureextinsrc = extra_in_source.count() extra_in_source.cache()and so on but before this its throwing out of memory exception while im fetching ... Data collection is indirect, with data being stored both on the JVM side and Python side. While JVM memory can be released once data goes through socket, peak memory usage should account for both. Plain toPandas implementation collects Rows first, then creates Pandas DataFrame locally. This further increases (possibly doubles) memory usage. . hydrocodone acetaminophen 10 325glp 1 meds SparkException:执行 spark 操作时 Python 工作线程无法连接回spark.SparkException: Python worker failed to connect back.问问题当我尝试在 pyspark 执行此命令行时from pyspark import SparkConf, SparkContext# 创建SparkConf和SparkContextconf = SparkConf().setMaster("local").setAppName("licCheck Apache Spark installation on Windows 10 steps. Use different versions of Apache Spark (tried 2.4.3 / 2.4.2 / 2.3.4). Disable firewall windows and antivirus that I have installed. Tried to initialize the SparkContext manually with sc = spark.sparkContext (found this possible solution at this question here in Stackoverflow, didn´t work for ...Apr 19, 2015 · org.apache.spark.SparkException: Job aborted due to stage failure: Task 7 in stage 0.0 failed 4 times, most recent failure: Lost task 7.3 in stage 0.0 (TID 11, fujitsu11.inevm.ru):java.lang.ClassNotFoundException: maven.maven1.Document java.net.URLClassLoader$1.run (URLClassLoader.java:366) java.net.URLClassLoader$1.run (URLClassLoader.java:35... Apr 9, 2021 · Viewed 8k times. 1. I am trying to do some computation using UDFs. But after the computation when i try to convert the pyspark dataframe to pandas it gives me org.apache.spark.SparkException: Exception thrown in awaitResult: I will put down the reproducible code. import pandas as pd import numpy as np import time n = 10000 sample_df = pd ... . nearby culver Jan 16, 2023 · If issue persists, please contact Microsoft support for further assistance","Details":"org.apache.spark.SparkException: Job aborted due to stage failure: Task 320 in stage 21.0 failed 1 times, most recent failure: Lost task 320.0 in stage 21.0 (TID 1297, vm-42929650, executor 1): ExecutorLostFailure (executor 1 exited caused by one of the ... Caused by: org.apache.spark.SparkException: Job aborted due to stage failure: Aborting TaskSet 0.0 because task 0 (partition 0) cannot run anywhere due to node and executor blacklist.Jan 4, 2019 · Exception in thread "main" org.apache.spark.SparkException: Job aborted due to stage failure: Task 0 in stage 2.0 failed 1 times, most recent failure: Lost task 0.0 in stage 2.0 (TID 119, localhost, executor driver): ExecutorLostFailure (executor driver exited caused by one of the running tasks) Reason: Executor heartbeat timed out after 128839 ... SparkException: Job aborted due to stage failure: Task 58 in stage 13.0 failed 4 times, most recent failure: Lost task 58.3 in stage 13.0 (TID 488, 10.32.14.43, executor 4): java.lang.IllegalArgumentException: Illegal pattern character 'Q'Check the Availability of Free RAM - whether it matches the expectation of the job being executed. Run below on each of the servers in the cluster and check how much RAM & Space they have in offer. free -h. If you are using any HDFS files in the Spark job , make sure to Specify & Correctly use the HDFS URL.. what time does the inside of mcdonald 不知道是什么原因。. (利用 Spark-submit 提交 参数都正常). 但是 集群上的版本是1.5,和2.0都无法跑出来结果,但是1.3就能出结果, 所以目前确定是 Spark 1.5以上的版本对协同过滤算法不兼容引起,具体原因不详。. task倾斜原因比较多,网络io,cpu,mem都有可能造成 ... Apr 9, 2021 · Viewed 8k times. 1. I am trying to do some computation using UDFs. But after the computation when i try to convert the pyspark dataframe to pandas it gives me org.apache.spark.SparkException: Exception thrown in awaitResult: I will put down the reproducible code. import pandas as pd import numpy as np import time n = 10000 sample_df = pd ... org.apache.spark.SparkException: Job aborted due to stage failure: 8 Databricks Exception: Total size of serialized results is bigger than spark.driver.maxResultsSizeData collection is indirect, with data being stored both on the JVM side and Python side. While JVM memory can be released once data goes through socket, peak memory usage should account for both. Plain toPandas implementation collects Rows first, then creates Pandas DataFrame locally. This further increases (possibly doubles) memory usage.May 11, 2022 · If absolutely necessary you can set the property spark.driver.maxResultSize to a value <X>g higher than the value reported in the exception message in the cluster Spark config ( AWS | Azure ): spark.driver.maxResultSize < X > g. The default value is 4g. For details, see Application Properties. If you set a high limit, out-of-memory errors can ... Teams. Q&A for work. Connect and share knowledge within a single location that is structured and easy to search. Learn more about Teams2 Answers. df.toPandas () collects all data to the driver node, hence it is very expensive operation. Also there is a spark property called maxResultSize. spark.driver.maxResultSize (default 1G) --> Limit of total size of serialized results of all partitions for each Spark action (e.g. collect) in bytes. Should be at least 1M, or 0 for unlimited.. washers for sale at lowe Saved searches Use saved searches to filter your results more quicklyException in thread "main" org.apache.spark.SparkException : Job aborted due to stage failure: Task 3 in stage 0.0 failed 4 times, most recent failure: Lost task 3.3 in stage 0.0 (TID 14, 192.168.10.38): ExecutorLostFailure (executor 3 lost) Driver stacktrace:.